Information card for entry 4343229
Common name | dimer15 |
Formula | C4 Cs3 O16 U |
Calculated formula | C4 Cs3 O16 U |
Title of publication | Cation templating and electronic structure effects in uranyl cage clusters probed by the isolation of peroxide-bridged uranyl dimers. |
Authors of publication | Qiu, Jie; Vlaisavljevich, Bess; Jouffret, Laurent; Nguyen, Kevin; Szymanowski, Jennifer E. S.; Gagliardi, Laura; Burns, Peter C. |
Journal of publication | Inorganic chemistry |
Year of publication | 2015 |
Journal volume | 54 |
Journal issue | 9 |
Pages of publication | 4445 - 4455 |
a | 7.8794 ± 0.0016 Å |
b | 10.45 ± 0.002 Å |
c | 11.106 ± 0.002 Å |
α | 109.505 ± 0.002° |
β | 93.175 ± 0.002° |
γ | 97.678 ± 0.003° |
Cell volume | 849.3 ± 0.3 Å3 |
Cell temperature | 100 ± 2 K |
Ambient diffraction temperature | 100 ± 2 K |
Number of distinct elements | 4 |
Space group number | 2 |
Hermann-Mauguin space group symbol | P -1 |
Hall space group symbol | -P 1 |
Residual factor for all reflections | 0.0861 |
Residual factor for significantly intense reflections | 0.0585 |
Weighted residual factors for significantly intense reflections | 0.1275 |
Weighted residual factors for all reflections included in the refinement | 0.1403 |
Goodness-of-fit parameter for all reflections included in the refinement | 1.115 |
Diffraction radiation wavelength | 0.71073 Å |
Diffraction radiation type | MoKα |