Information card for entry 4343236
Formula | C28 H20 Cd0.5 Dy O8 |
Calculated formula | C28 H20 Cd0.5 Dy O8 |
Title of publication | Utilizing 3d-4f magnetic interaction to slow the magnetic relaxation of heterometallic complexes. |
Authors of publication | Li, Xiao-Lei; Min, Fan-Yong; Wang, Chao; Lin, Shuang-Yan; Liu, Zhiliang; Tang, Jinkui |
Journal of publication | Inorganic chemistry |
Year of publication | 2015 |
Journal volume | 54 |
Journal issue | 9 |
Pages of publication | 4337 - 4344 |
a | 10.024 ± 0.004 Å |
b | 11.08 ± 0.004 Å |
c | 12.217 ± 0.005 Å |
α | 95.506 ± 0.007° |
β | 113.574 ± 0.006° |
γ | 93.738 ± 0.007° |
Cell volume | 1229.9 ± 0.8 Å3 |
Cell temperature | 298 ± 2 K |
Ambient diffraction temperature | 298 ± 2 K |
Number of distinct elements | 5 |
Space group number | 2 |
Hermann-Mauguin space group symbol | P -1 |
Hall space group symbol | -P 1 |
Residual factor for all reflections | 0.061 |
Residual factor for significantly intense reflections | 0.0408 |
Weighted residual factors for significantly intense reflections | 0.0831 |
Weighted residual factors for all reflections included in the refinement | 0.0912 |
Goodness-of-fit parameter for all reflections included in the refinement | 0.995 |
Diffraction radiation wavelength | 0.71073 Å |
Diffraction radiation type | MoKα |