Information card for entry 4343238
Formula | C88 H100 F4 N16 O96 P2 W24 Zn3 |
Calculated formula | C88 H96 F4 N16 O96 P2 W24 Zn3 |
Title of publication | Multifunctional radical-doped polyoxometalate-based host-guest material: photochromism and photocatalytic activity. |
Authors of publication | Liao, Jian-Zhen; Zhang, Hai-Long; Wang, Sa-Sa; Yong, Jian-Ping; Wu, Xiao-Yuan; Yu, Rongmin; Lu, Can-Zhong |
Journal of publication | Inorganic chemistry |
Year of publication | 2015 |
Journal volume | 54 |
Journal issue | 9 |
Pages of publication | 4345 - 4350 |
a | 19.4643 ± 0.0004 Å |
b | 19.4643 ± 0.0004 Å |
c | 25.534 ± 0.0009 Å |
α | 90° |
β | 90° |
γ | 90° |
Cell volume | 9673.8 ± 0.4 Å3 |
Cell temperature | 173 ± 2 K |
Ambient diffraction temperature | 173 ± 2 K |
Number of distinct elements | 8 |
Space group number | 126 |
Hermann-Mauguin space group symbol | P 4/n n c :2 |
Hall space group symbol | -P 4a 2bc |
Residual factor for all reflections | 0.0628 |
Residual factor for significantly intense reflections | 0.0579 |
Weighted residual factors for significantly intense reflections | 0.128 |
Weighted residual factors for all reflections included in the refinement | 0.131 |
Goodness-of-fit parameter for all reflections included in the refinement | 1.228 |
Diffraction radiation wavelength | 1.54184 Å |
Diffraction radiation type | CuKα |