Information card for entry 4343251
Common name | tc78 |
Formula | C34 H30 F6 Fe N6 O6 S2 |
Calculated formula | C34 H30 F6 Fe N6 O6 S2 |
SMILES | c1cccc2C3(C)c4cccc[n]4[Fe]45([n]12)([n]1c3cc(cc1C(c1cccc[n]41)(C)c1cccc[n]51)C)[N]#CC.C(F)(F)(F)S(=O)(=O)[O-].C(F)(F)(F)S(=O)(=O)[O-] |
Title of publication | Water-Soluble Iron(IV)-Oxo Complexes Supported by Pentapyridine Ligands: Axial Ligand Effects on Hydrogen Atom and Oxygen Atom Transfer Reactivity. |
Authors of publication | Chantarojsiri, Teera; Sun, Yujie; Long, Jeffrey R.; Chang, Christopher J. |
Journal of publication | Inorganic chemistry |
Year of publication | 2015 |
Journal volume | 54 |
Journal issue | 12 |
Pages of publication | 5879 - 5887 |
a | 9.1512 ± 0.0003 Å |
b | 16.8978 ± 0.0005 Å |
c | 22.2872 ± 0.0006 Å |
α | 90° |
β | 91.732 ± 0.001° |
γ | 90° |
Cell volume | 3444.81 ± 0.18 Å3 |
Cell temperature | 100 ± 2 K |
Ambient diffraction temperature | 100 ± 2 K |
Number of distinct elements | 7 |
Space group number | 14 |
Hermann-Mauguin space group symbol | P 1 21/n 1 |
Hall space group symbol | -P 2yn |
Residual factor for all reflections | 0.0545 |
Residual factor for significantly intense reflections | 0.0471 |
Weighted residual factors for significantly intense reflections | 0.134 |
Weighted residual factors for all reflections included in the refinement | 0.141 |
Goodness-of-fit parameter for all reflections included in the refinement | 1.075 |
Diffraction radiation wavelength | 0.71073 Å |
Diffraction radiation type | MoKα |