Information card for entry 4343257
Common name | tc73 |
Formula | C37 H34 F6 Fe N8 O6 S2 |
Calculated formula | C37 H34 F6 Fe N8 O6 S2 |
SMILES | c1cccc2C3(C)c4cccc[n]4[Fe]45([n]12)([n]1c3cccc1C(c1cccc[n]41)(C)c1cccc[n]51)[N]#CC.C(F)(F)(F)S(=O)(=O)[O-].C(F)(F)(F)S(=O)(=O)[O-].C(#N)C.C(#N)C |
Title of publication | Water-Soluble Iron(IV)-Oxo Complexes Supported by Pentapyridine Ligands: Axial Ligand Effects on Hydrogen Atom and Oxygen Atom Transfer Reactivity. |
Authors of publication | Chantarojsiri, Teera; Sun, Yujie; Long, Jeffrey R.; Chang, Christopher J. |
Journal of publication | Inorganic chemistry |
Year of publication | 2015 |
Journal volume | 54 |
Journal issue | 12 |
Pages of publication | 5879 - 5887 |
a | 12.477 ± 0.001 Å |
b | 15.802 ± 0.001 Å |
c | 19.94 ± 0.001 Å |
α | 90° |
β | 90.898 ± 0.001° |
γ | 90° |
Cell volume | 3930.9 ± 0.4 Å3 |
Cell temperature | 100 ± 2 K |
Ambient diffraction temperature | 100 ± 2 K |
Number of distinct elements | 7 |
Space group number | 14 |
Hermann-Mauguin space group symbol | P 1 21/n 1 |
Hall space group symbol | -P 2yn |
Residual factor for all reflections | 0.0422 |
Residual factor for significantly intense reflections | 0.0363 |
Weighted residual factors for significantly intense reflections | 0.0895 |
Weighted residual factors for all reflections included in the refinement | 0.0944 |
Goodness-of-fit parameter for all reflections included in the refinement | 1.054 |
Diffraction radiation wavelength | 0.71073 Å |
Diffraction radiation type | MoKα |