Information card for entry 4343265
Formula | C24 H30 Mn3 N2 O22 |
Calculated formula | C24 H30 Mn3 N2 O22 |
Title of publication | Structural Induction Effect of a Zwitterion Pyridiniumolate for Metal-Organic Frameworks. |
Authors of publication | Su, Jian; Yao, Liudi; Zhao, Meng; Wang, Hui; Zhang, Qiong; Cheng, Longjiu; Zhang, Jun; Zhang, Shengyi; Wu, Jieying; Tian, Yupeng |
Journal of publication | Inorganic chemistry |
Year of publication | 2015 |
Journal volume | 54 |
Journal issue | 13 |
Pages of publication | 6169 - 6175 |
a | 19.1035 ± 0.0009 Å |
b | 9.543 ± 0.0004 Å |
c | 17.6708 ± 0.0008 Å |
α | 90° |
β | 90° |
γ | 90° |
Cell volume | 3221.5 ± 0.3 Å3 |
Cell temperature | 291 ± 2 K |
Ambient diffraction temperature | 291 ± 2 K |
Number of distinct elements | 5 |
Space group number | 60 |
Hermann-Mauguin space group symbol | P b c n |
Hall space group symbol | -P 2n 2ab |
Residual factor for all reflections | 0.0353 |
Residual factor for significantly intense reflections | 0.0284 |
Weighted residual factors for significantly intense reflections | 0.0731 |
Weighted residual factors for all reflections included in the refinement | 0.0773 |
Goodness-of-fit parameter for all reflections included in the refinement | 1.036 |
Diffraction radiation wavelength | 0.71073 Å |
Diffraction radiation type | MoKα |