Information card for entry 4343281
Formula | C58 H88 Cl Ga N2 O2 |
Calculated formula | C58 H88 Cl Ga N2 O2 |
Title of publication | Indirect Magnetic Exchange between o-Iminosemiquinonate Ligands Controlled by Apical Substituent in Pentacoordinated Gallium(III) Complexes. |
Authors of publication | Piskunov, Alexander V.; Ershova, Irina V.; Bogomyakov, Artem S.; Starikov, Andrey G.; Fukin, Georgy K.; Cherkasov, Vladimir K. |
Journal of publication | Inorganic chemistry |
Year of publication | 2015 |
Journal volume | 54 |
Journal issue | 13 |
Pages of publication | 6090 - 6099 |
a | 16.114 ± 0.0007 Å |
b | 20.3869 ± 0.0009 Å |
c | 17.0285 ± 0.0008 Å |
α | 90° |
β | 91.3079 ± 0.0011° |
γ | 90° |
Cell volume | 5592.7 ± 0.4 Å3 |
Cell temperature | 100 ± 2 K |
Ambient diffraction temperature | 100 ± 2 K |
Number of distinct elements | 6 |
Space group number | 14 |
Hermann-Mauguin space group symbol | P 1 21/n 1 |
Hall space group symbol | -P 2yn |
Residual factor for all reflections | 0.0547 |
Residual factor for significantly intense reflections | 0.0412 |
Weighted residual factors for significantly intense reflections | 0.1075 |
Weighted residual factors for all reflections included in the refinement | 0.1134 |
Goodness-of-fit parameter for all reflections included in the refinement | 1.06 |
Diffraction radiation wavelength | 0.71073 Å |
Diffraction radiation type | MoKα |