Information card for entry 4343284
Common name | Cobalt Carboxylate |
Formula | C15 H12.5 Co N2.5 O6 |
Calculated formula | C15 H12.5 Co N2.5 O6 |
Title of publication | Highly Selective and Sensitive Luminescence Turn-On-Based Sensing of Al(3+) Ions in Aqueous Medium Using a MOF with Free Functional Sites. |
Authors of publication | Singha, Debal Kanti; Mahata, Partha |
Journal of publication | Inorganic chemistry |
Year of publication | 2015 |
Journal volume | 54 |
Journal issue | 13 |
Pages of publication | 6373 - 6379 |
a | 14.028 ± 0.0004 Å |
b | 29.3136 ± 0.0008 Å |
c | 7.3395 ± 0.0002 Å |
α | 90° |
β | 90° |
γ | 90° |
Cell volume | 3018.08 ± 0.14 Å3 |
Cell temperature | 296 ± 2 K |
Ambient diffraction temperature | 296 ± 2 K |
Number of distinct elements | 5 |
Space group number | 41 |
Hermann-Mauguin space group symbol | A b a 2 |
Hall space group symbol | A 2 -2ab |
Residual factor for all reflections | 0.0372 |
Residual factor for significantly intense reflections | 0.0319 |
Weighted residual factors for significantly intense reflections | 0.0798 |
Weighted residual factors for all reflections included in the refinement | 0.0948 |
Goodness-of-fit parameter for all reflections included in the refinement | 1.108 |
Diffraction radiation wavelength | 0.71073 Å |
Diffraction radiation type | MoKα |