Information card for entry 4343303
Formula | C63 H50 B F24 N2 Rh |
Calculated formula | C63 H50 B F24 N2 Rh |
Title of publication | Synthesis and Reactivity toward H2 of (η(5)-C5Me5)Rh(III) Complexes with Bulky Aminopyridinate Ligands. |
Authors of publication | Zamorano, Ana; Rendón, Nuria; Valpuesta, José E V; Álvarez, Eleuterio; Carmona, Ernesto |
Journal of publication | Inorganic chemistry |
Year of publication | 2015 |
Journal volume | 54 |
Journal issue | 13 |
Pages of publication | 6573 - 6581 |
a | 12.1424 ± 0.0007 Å |
b | 28.8265 ± 0.0015 Å |
c | 17.5949 ± 0.0009 Å |
α | 90° |
β | 90.497 ± 0.003° |
γ | 90° |
Cell volume | 6158.4 ± 0.6 Å3 |
Cell temperature | 173 ± 2 K |
Ambient diffraction temperature | 173 ± 2 K |
Number of distinct elements | 6 |
Space group number | 14 |
Hermann-Mauguin space group symbol | P 1 21/n 1 |
Hall space group symbol | -P 2yn |
Residual factor for all reflections | 0.1181 |
Residual factor for significantly intense reflections | 0.0623 |
Weighted residual factors for significantly intense reflections | 0.1479 |
Weighted residual factors for all reflections included in the refinement | 0.2177 |
Goodness-of-fit parameter for all reflections included in the refinement | 1.079 |
Diffraction radiation wavelength | 0.71073 Å |
Diffraction radiation type | MoKα |