Information card for entry 4343318
Formula | C22 H26 N4 O2 P2 S2 |
Calculated formula | C22 H26 N4 O2 P2 S2 |
Title of publication | Synthesis and Hydrolytic Studies on the Air-Stable [(4-CN-PhO)(E)P(μ-N(t)Bu)]2 (E = O, S, and Se) Cyclodiphosphazanes. |
Authors of publication | Shi, Yan X.; Liang, Rong Z.; Martin, Katherine A.; Weston, Nicholas; Gonzalez-Calera, Silvia; Ganguly, Rakesh; Li, Yongxin; Lu, Yunpeng; Ribeiro, António J M; Ramos, Maria J.; Fernandes, Pedro A.; García, Felipe |
Journal of publication | Inorganic chemistry |
Year of publication | 2015 |
Journal volume | 54 |
Journal issue | 13 |
Pages of publication | 6423 - 6432 |
a | 8.66 ± 0.003 Å |
b | 8.684 ± 0.003 Å |
c | 17.225 ± 0.005 Å |
α | 88.33 ± 0.012° |
β | 89.43 ± 0.011° |
γ | 70.346 ± 0.012° |
Cell volume | 1219.4 ± 0.7 Å3 |
Cell temperature | 103 ± 2 K |
Ambient diffraction temperature | 103 ± 2 K |
Number of distinct elements | 6 |
Space group number | 2 |
Hermann-Mauguin space group symbol | P -1 |
Hall space group symbol | -P 1 |
Residual factor for all reflections | 0.1536 |
Residual factor for significantly intense reflections | 0.1349 |
Weighted residual factors for significantly intense reflections | 0.3626 |
Weighted residual factors for all reflections included in the refinement | 0.3719 |
Goodness-of-fit parameter for all reflections included in the refinement | 1.151 |
Diffraction radiation wavelength | 0.71073 Å |