Information card for entry 4343323
Formula | Cs4.5 Fe14 H222 K14 Na9.5 O277 P6 Si4 W36 |
Calculated formula | Cs4 Fe14 K14 Na9 O199 P4 Si4 W36 |
Title of publication | Tetradecanuclear Iron(III)-Oxo Nanoclusters Stabilized by Trilacunary Heteropolyanions. |
Authors of publication | Ibrahim, Masooma; Haider, Ali; Xiang, Yixian; Bassil, Bassem S.; Carey, Akina M.; Rullik, Lisa; Jameson, Geoffrey B.; Doungmene, Floriant; Mbomekallé, Israël M; Oliveira, Pedro de; Mereacre, Valeriu; Kostakis, George E.; Powell, Annie K.; Kortz, Ulrich |
Journal of publication | Inorganic chemistry |
Year of publication | 2015 |
Journal volume | 54 |
Journal issue | 13 |
Pages of publication | 6136 - 6146 |
a | 22.7572 ± 0.001 Å |
b | 27.833 ± 0.0012 Å |
c | 18.7848 ± 0.0008 Å |
α | 90° |
β | 90° |
γ | 90° |
Cell volume | 11898.3 ± 0.9 Å3 |
Cell temperature | 100 ± 2 K |
Ambient diffraction temperature | 100 ± 2 K |
Number of distinct elements | 9 |
Space group number | 59 |
Hermann-Mauguin space group symbol | P m m n |
Hall space group symbol | -P 2ab 2a |
Residual factor for all reflections | 0.0674 |
Residual factor for significantly intense reflections | 0.0536 |
Weighted residual factors for significantly intense reflections | 0.1236 |
Weighted residual factors for all reflections included in the refinement | 0.1295 |
Goodness-of-fit parameter for all reflections included in the refinement | 1.119 |
Diffraction radiation wavelength | 0.71073 Å |
Diffraction radiation type | MoKα |