Information card for entry 4343338
Formula | C17 H27 N2 O9 Re |
Calculated formula | C17 H27 N2 O9 Re |
Title of publication | Structure and Properties of fac-[Re(I)(CO)3(NTA)](2-) (NTA(3-) = Trianion of Nitrilotriacetic Acid) and fac-[Re(I)(CO)3(L)](n-) Analogues Useful for Assessing the Excellent Renal Clearance of the fac-[(99m)Tc(I)(CO)3(NTA)](2-) Diagnostic Renal Agent. |
Authors of publication | Klenc, Jeffrey; Lipowska, Malgorzata; Abhayawardhana, Pramuditha L.; Taylor, Andrew T.; Marzilli, Luigi G. |
Journal of publication | Inorganic chemistry |
Year of publication | 2015 |
Journal volume | 54 |
Journal issue | 13 |
Pages of publication | 6281 - 6290 |
a | 7.6992 ± 0.0009 Å |
b | 10.5716 ± 0.0011 Å |
c | 25.726 ± 0.003 Å |
α | 90° |
β | 96.931 ± 0.004° |
γ | 90° |
Cell volume | 2078.6 ± 0.4 Å3 |
Cell temperature | 173 ± 2 K |
Ambient diffraction temperature | 173 ± 2 K |
Number of distinct elements | 5 |
Space group number | 14 |
Hermann-Mauguin space group symbol | P 1 21/n 1 |
Hall space group symbol | -P 2yn |
Residual factor for all reflections | 0.0372 |
Residual factor for significantly intense reflections | 0.0372 |
Weighted residual factors for significantly intense reflections | 0.0974 |
Weighted residual factors for all reflections included in the refinement | 0.0974 |
Goodness-of-fit parameter for all reflections included in the refinement | 1.28 |
Diffraction radiation wavelength | 1.54178 Å |
Diffraction radiation type | CuKα |