Information card for entry 4343350
Formula | C25 H42 Au2 Br2 N8 O2 |
Calculated formula | C25 H42 Au2 Br2 N8 O2 |
SMILES | C12N(C=CN1CC)CCN1C(N(C=C1)CC)=[Au]=C1N(C=CN1CC)CCN1C=CN(C1=[Au]=2)CC.CO.O.[Br-].[Br-] |
Title of publication | Stretch Out or Fold Back? Conformations of Dinuclear Gold(I) N-Heterocyclic Carbene Macrocycles. |
Authors of publication | Kobialka, Stefanie; Müller-Tautges, Christina; Schmidt, Melanie T. S.; Schnakenburg, Gregor; Hollóczki, Oldamur; Kirchner, Barbara; Engeser, Marianne |
Journal of publication | Inorganic chemistry |
Year of publication | 2015 |
Journal volume | 54 |
Journal issue | 13 |
Pages of publication | 6100 - 6111 |
a | 12.4982 ± 0.0006 Å |
b | 19.0817 ± 0.0009 Å |
c | 13.4521 ± 0.0007 Å |
α | 90° |
β | 91.013 ± 0.002° |
γ | 90° |
Cell volume | 3207.6 ± 0.3 Å3 |
Cell temperature | 100 ± 2 K |
Ambient diffraction temperature | 100 ± 2 K |
Number of distinct elements | 6 |
Space group number | 14 |
Hermann-Mauguin space group symbol | P 1 21/n 1 |
Hall space group symbol | -P 2yn |
Residual factor for all reflections | 0.0402 |
Residual factor for significantly intense reflections | 0.0311 |
Weighted residual factors for significantly intense reflections | 0.0622 |
Weighted residual factors for all reflections included in the refinement | 0.0651 |
Goodness-of-fit parameter for all reflections included in the refinement | 1.078 |
Diffraction radiation wavelength | 0.71073 Å |
Diffraction radiation type | MoKα |