Information card for entry 4343356
Formula | C56 H90 Au4 F24 N16 O P4 |
Calculated formula | C56 H90 Au4 F24 N16 O P4 |
Title of publication | Stretch Out or Fold Back? Conformations of Dinuclear Gold(I) N-Heterocyclic Carbene Macrocycles. |
Authors of publication | Kobialka, Stefanie; Müller-Tautges, Christina; Schmidt, Melanie T. S.; Schnakenburg, Gregor; Hollóczki, Oldamur; Kirchner, Barbara; Engeser, Marianne |
Journal of publication | Inorganic chemistry |
Year of publication | 2015 |
Journal volume | 54 |
Journal issue | 13 |
Pages of publication | 6100 - 6111 |
a | 12.0982 ± 0.0018 Å |
b | 12.5843 ± 0.0018 Å |
c | 14.952 ± 0.002 Å |
α | 77.062 ± 0.005° |
β | 78.543 ± 0.005° |
γ | 63.762 ± 0.005° |
Cell volume | 1977 ± 0.5 Å3 |
Cell temperature | 123 ± 2 K |
Ambient diffraction temperature | 123 ± 2 K |
Number of distinct elements | 7 |
Space group number | 2 |
Hermann-Mauguin space group symbol | P -1 |
Hall space group symbol | -P 1 |
Residual factor for all reflections | 0.0693 |
Residual factor for significantly intense reflections | 0.0456 |
Weighted residual factors for significantly intense reflections | 0.1357 |
Weighted residual factors for all reflections included in the refinement | 0.1551 |
Goodness-of-fit parameter for all reflections included in the refinement | 1.029 |
Diffraction radiation wavelength | 0.71073 Å |
Diffraction radiation type | MoKα |