Information card for entry 4343361
Formula | C90 H70 Au2 B2 Co F8 N10 P2 |
Calculated formula | C90 H70 Au2 B2 Co F8 N10 P2 |
Title of publication | Assembly of Heterometallic Rigid-Rod Complexes and Coordination Oligomers from Gold(I) Metalloligands. |
Authors of publication | Cámara, Verónica; Barquero, Natalia; Bautista, Delia; Gil-Rubio, Juan; Vicente, José |
Journal of publication | Inorganic chemistry |
Year of publication | 2015 |
Journal volume | 54 |
Journal issue | 13 |
Pages of publication | 6147 - 6156 |
a | 12.596 ± 0.0011 Å |
b | 17.282 ± 0.0015 Å |
c | 18.9869 ± 0.0016 Å |
α | 101.911 ± 0.003° |
β | 99.445 ± 0.003° |
γ | 92.717 ± 0.003° |
Cell volume | 3975.2 ± 0.6 Å3 |
Cell temperature | 100 ± 2 K |
Ambient diffraction temperature | 100 ± 2 K |
Number of distinct elements | 8 |
Space group number | 2 |
Hermann-Mauguin space group symbol | P -1 |
Hall space group symbol | -P 1 |
Residual factor for all reflections | 0.0769 |
Residual factor for significantly intense reflections | 0.042 |
Weighted residual factors for significantly intense reflections | 0.0724 |
Weighted residual factors for all reflections included in the refinement | 0.0805 |
Goodness-of-fit parameter for all reflections included in the refinement | 1.058 |
Diffraction radiation wavelength | 0.71073 Å |
Diffraction radiation type | MoKα |