Information card for entry 4343370
Formula | C40 H56 Al Cu2 N2 O |
Calculated formula | C40 H56 Al Cu2 N2 O |
Title of publication | Synthesis and Characterization of Heterobimetallic Al-O-Cu Complexes toward Models for Heterogeneous Catalysts on Metal Oxide Surfaces. |
Authors of publication | Li, Bin; Zhang, Chunyan; Yang, Ying; Zhu, Hongping; Roesky, Herbert W. |
Journal of publication | Inorganic chemistry |
Year of publication | 2015 |
Journal volume | 54 |
Journal issue | 13 |
Pages of publication | 6641 - 6646 |
a | 11.5545 ± 0.0008 Å |
b | 11.683 ± 0.0007 Å |
c | 15.6383 ± 0.001 Å |
α | 107.429 ± 0.005° |
β | 101.279 ± 0.006° |
γ | 98.43 ± 0.005° |
Cell volume | 1927.1 ± 0.2 Å3 |
Cell temperature | 173 ± 2 K |
Ambient diffraction temperature | 173 ± 2 K |
Number of distinct elements | 6 |
Space group number | 2 |
Hermann-Mauguin space group symbol | P -1 |
Hall space group symbol | -P 1 |
Residual factor for all reflections | 0.081 |
Residual factor for significantly intense reflections | 0.0532 |
Weighted residual factors for significantly intense reflections | 0.107 |
Weighted residual factors for all reflections included in the refinement | 0.1168 |
Goodness-of-fit parameter for all reflections included in the refinement | 1.013 |
Diffraction radiation wavelength | 0.71073 Å |
Diffraction radiation type | MoKα |