Information card for entry 4343387
Formula | C15 H8 Dy N2 O6 |
Calculated formula | C15 H8 Dy N2 O6 |
Title of publication | Lanthanide Coordination Polymers with 4,4'-Azobenzoic Acid: Enhanced Stability and Magnetocaloric Effect by Removing Guest Solvents. |
Authors of publication | Zhang, Shaowei; Duan, Eryue; Han, Zongsu; Li, Leilei; Cheng, Peng |
Journal of publication | Inorganic chemistry |
Year of publication | 2015 |
Journal volume | 54 |
Journal issue | 13 |
Pages of publication | 6498 - 6503 |
a | 16.6746 ± 0.0004 Å |
b | 12.7263 ± 0.0003 Å |
c | 6.77786 ± 0.00018 Å |
α | 90° |
β | 93.634 ± 0.002° |
γ | 90° |
Cell volume | 1435.41 ± 0.06 Å3 |
Cell temperature | 121.5 ± 0.14 K |
Ambient diffraction temperature | 121.5 ± 0.14 K |
Number of distinct elements | 5 |
Space group number | 14 |
Hermann-Mauguin space group symbol | P 1 21/c 1 |
Hall space group symbol | -P 2ybc |
Residual factor for all reflections | 0.0445 |
Residual factor for significantly intense reflections | 0.0427 |
Weighted residual factors for significantly intense reflections | 0.1017 |
Weighted residual factors for all reflections included in the refinement | 0.1025 |
Goodness-of-fit parameter for all reflections included in the refinement | 1.15 |
Diffraction radiation wavelength | 0.71073 Å |
Diffraction radiation type | MoKα |