Information card for entry 4343392
Formula | C22 H32 Cl2 Fe N2 |
Calculated formula | C22 H32 Cl2 Fe N2 |
SMILES | C1(C(Cl)Cl)N([c]23[cH]4[cH]5[cH]6[cH]2[Fe]27893456[c]3([cH]2[cH]7[cH]8[cH]93)N1CC(C)(C)C)CC(C)(C)C |
Title of publication | A Stable Planar-Chiral N-Heterocyclic Carbene with a 1,1'-Ferrocenediyl Backbone. |
Authors of publication | Petrov, Alex R.; Derheim, Anatoli; Oetzel, Jan; Leibold, Michael; Bruhn, Clemens; Scheerer, Stefan; Oßwald, Steffen; Winter, Rainer F.; Siemeling, Ulrich |
Journal of publication | Inorganic chemistry |
Year of publication | 2015 |
Journal volume | 54 |
Journal issue | 13 |
Pages of publication | 6657 - 6670 |
a | 10.2598 ± 0.0005 Å |
b | 23.3257 ± 0.0015 Å |
c | 10.0167 ± 0.0005 Å |
α | 90° |
β | 113.568 ± 0.004° |
γ | 90° |
Cell volume | 2197.2 ± 0.2 Å3 |
Cell temperature | 173 ± 2 K |
Ambient diffraction temperature | 173 ± 2 K |
Number of distinct elements | 5 |
Space group number | 14 |
Hermann-Mauguin space group symbol | P 1 21/c 1 |
Hall space group symbol | -P 2ybc |
Residual factor for all reflections | 0.0349 |
Residual factor for significantly intense reflections | 0.0279 |
Weighted residual factors for significantly intense reflections | 0.0671 |
Weighted residual factors for all reflections included in the refinement | 0.0713 |
Goodness-of-fit parameter for all reflections included in the refinement | 1.053 |
Diffraction radiation wavelength | 0.71073 Å |
Diffraction radiation type | MoKα |