Information card for entry 4343395
Formula | C30 H48 Cl2 Fe N2 |
Calculated formula | C30 H48 Cl2 Fe N2 |
SMILES | C1(C(Cl)Cl)N([c]23[cH]4[c]5([cH]6[cH]2[Fe]27893456[c]3([cH]2[c]7([cH]8[cH]93)C(C)(C)C)N1CC(C)(C)C)C(C)(C)C)CC(C)(C)C |
Title of publication | A Stable Planar-Chiral N-Heterocyclic Carbene with a 1,1'-Ferrocenediyl Backbone. |
Authors of publication | Petrov, Alex R.; Derheim, Anatoli; Oetzel, Jan; Leibold, Michael; Bruhn, Clemens; Scheerer, Stefan; Oßwald, Steffen; Winter, Rainer F.; Siemeling, Ulrich |
Journal of publication | Inorganic chemistry |
Year of publication | 2015 |
Journal volume | 54 |
Journal issue | 13 |
Pages of publication | 6657 - 6670 |
a | 21.5012 ± 0.0012 Å |
b | 8.0519 ± 0.0002 Å |
c | 18.5315 ± 0.0009 Å |
α | 90° |
β | 110.721 ± 0.004° |
γ | 90° |
Cell volume | 3000.7 ± 0.2 Å3 |
Cell temperature | 100 ± 2 K |
Ambient diffraction temperature | 100 ± 2 K |
Number of distinct elements | 5 |
Space group number | 14 |
Hermann-Mauguin space group symbol | P 1 21/c 1 |
Hall space group symbol | -P 2ybc |
Residual factor for all reflections | 0.0448 |
Residual factor for significantly intense reflections | 0.0346 |
Weighted residual factors for significantly intense reflections | 0.0808 |
Weighted residual factors for all reflections included in the refinement | 0.088 |
Goodness-of-fit parameter for all reflections included in the refinement | 0.992 |
Diffraction radiation wavelength | 0.71073 Å |
Diffraction radiation type | MoKα |