Information card for entry 4343428
Formula | C20 H28 Co2 N4 O18 P4 |
Calculated formula | C20 H28 Co2 N4 O18 P4 |
SMILES | c1cccc2c3[n](cccc3)[Co]34([n]12)([O]=P(OP(=O)(O3)O)(O)O[Co]12([n]3ccccc3c3cccc[n]13)([O]=P(O)(O4)OP(=O)(O2)O)[OH2])[OH2].O.O |
Title of publication | Ferromagnetic Coupling in "Double-Bridged" Dihydrogenpyrophosphate Complexes of Cobalt(II) and Nickel(II). |
Authors of publication | Greenfield, Tiffany J.; Hoffman, Amanda E.; Marino, Nadia; Goos, Alan G.; Lloret, Francesc; Julve, Miguel; Doyle, Robert P. |
Journal of publication | Inorganic chemistry |
Year of publication | 2015 |
Journal volume | 54 |
Journal issue | 13 |
Pages of publication | 6537 - 6546 |
a | 8.0269 ± 0.0011 Å |
b | 9.6018 ± 0.0013 Å |
c | 10.8292 ± 0.0015 Å |
α | 83.373 ± 0.003° |
β | 79.281 ± 0.003° |
γ | 67.531 ± 0.002° |
Cell volume | 756.91 ± 0.18 Å3 |
Cell temperature | 90 ± 2 K |
Ambient diffraction temperature | 90 ± 2 K |
Number of distinct elements | 6 |
Space group number | 2 |
Hermann-Mauguin space group symbol | P -1 |
Hall space group symbol | -P 1 |
Residual factor for all reflections | 0.0625 |
Residual factor for significantly intense reflections | 0.0369 |
Weighted residual factors for significantly intense reflections | 0.0758 |
Weighted residual factors for all reflections included in the refinement | 0.0828 |
Goodness-of-fit parameter for all reflections included in the refinement | 0.978 |
Diffraction radiation wavelength | 0.71073 Å |
Diffraction radiation type | MoKα |