Information card for entry 4343454
Formula | C18 H18 Fe N4 |
Calculated formula | C18 H18 Fe N4 |
Title of publication | 1,1'-Bis(pyrazol-3-yl)ferrocene: A Clip Ligand That Forms Supramolecular Aggregates and Prismatic Hexanuclear Coinage Metal Complexes. |
Authors of publication | Veronelli, Mattia; Dechert, Sebastian; Demeshko, Serhiy; Meyer, Franc |
Journal of publication | Inorganic chemistry |
Year of publication | 2015 |
Journal volume | 54 |
Journal issue | 14 |
Pages of publication | 6917 - 6927 |
a | 20.2254 ± 0.0013 Å |
b | 13.4796 ± 0.0007 Å |
c | 11.5855 ± 0.0007 Å |
α | 90° |
β | 95.455 ± 0.005° |
γ | 90° |
Cell volume | 3144.3 ± 0.3 Å3 |
Cell temperature | 133 ± 2 K |
Ambient diffraction temperature | 133 ± 2 K |
Number of distinct elements | 4 |
Space group number | 15 |
Hermann-Mauguin space group symbol | C 1 2/c 1 |
Hall space group symbol | -C 2yc |
Residual factor for all reflections | 0.0455 |
Residual factor for significantly intense reflections | 0.0332 |
Weighted residual factors for significantly intense reflections | 0.0772 |
Weighted residual factors for all reflections included in the refinement | 0.081 |
Goodness-of-fit parameter for all reflections included in the refinement | 0.999 |
Diffraction radiation wavelength | 0.71073 Å |
Diffraction radiation type | MoKα |