Information card for entry 4343469
Formula | C42 H38 Au F14 P5 Pd |
Calculated formula | C42 H38 Au F14 P5 Pd |
Title of publication | Metallophilic Contacts in 2-C6F4PPh2 Bridged Heterobinuclear Complexes: A Crystallographic and Computational Study. |
Authors of publication | Wächtler, Erik; Privér, Steven H; Wagler, Jörg; Heine, Thomas; Zhechkov, Lyuben; Bennett, Martin A.; Bhargava, Suresh K. |
Journal of publication | Inorganic chemistry |
Year of publication | 2015 |
Journal volume | 54 |
Journal issue | 14 |
Pages of publication | 6947 - 6957 |
a | 18.1286 ± 0.0018 Å |
b | 21.628 ± 0.002 Å |
c | 22.77 ± 0.002 Å |
α | 90° |
β | 90° |
γ | 90° |
Cell volume | 8927.8 ± 1.4 Å3 |
Cell temperature | 100 ± 2 K |
Ambient diffraction temperature | 100 ± 2 K |
Number of distinct elements | 6 |
Space group number | 61 |
Hermann-Mauguin space group symbol | P b c a |
Hall space group symbol | -P 2ac 2ab |
Residual factor for all reflections | 0.0777 |
Residual factor for significantly intense reflections | 0.0375 |
Weighted residual factors for significantly intense reflections | 0.059 |
Weighted residual factors for all reflections included in the refinement | 0.0688 |
Goodness-of-fit parameter for all reflections included in the refinement | 1.002 |
Diffraction radiation wavelength | 0.71073 Å |
Diffraction radiation type | MoKα |