Information card for entry 4343482
Common name | Pd(k1-N-m-BrArNO)2(CNArDipp2)2 |
Formula | C82 H102 Br2 N4 O4 Pd |
Calculated formula | C82 H102 Br2 N4 O4 Pd |
SMILES | [N](c1cc(Br)ccc1)(=O)[Pd](C#[N]c1c(c2c(cccc2C(C)C)C(C)C)cccc1c1c(cccc1C(C)C)C(C)C)(C#[N]c1c(cccc1c1c(cccc1C(C)C)C(C)C)c1c(cccc1C(C)C)C(C)C)[N](=O)c1cc(Br)ccc1.C(C)OCC.C(C)OCC |
Title of publication | Solution Dynamics of Redox Noninnocent Nitrosoarene Ligands: Mapping the Electronic Criteria for the Formation of Persistent Metal-Coordinated Nitroxide Radicals. |
Authors of publication | Barnett, Brandon R.; Labios, Liezel A.; Moore, Curtis E.; England, Jason; Rheingold, Arnold L.; Wieghardt, Karl; Figueroa, Joshua S. |
Journal of publication | Inorganic chemistry |
Year of publication | 2015 |
Journal volume | 54 |
Journal issue | 14 |
Pages of publication | 7110 - 7121 |
a | 12.13 ± 0.002 Å |
b | 24.738 ± 0.004 Å |
c | 12.783 ± 0.002 Å |
α | 90° |
β | 99.112 ± 0.003° |
γ | 90° |
Cell volume | 3787.4 ± 1.1 Å3 |
Cell temperature | 100 ± 2 K |
Ambient diffraction temperature | 100 ± 2 K |
Number of distinct elements | 6 |
Space group number | 14 |
Hermann-Mauguin space group symbol | P 1 21/n 1 |
Hall space group symbol | -P 2yn |
Residual factor for all reflections | 0.103 |
Residual factor for significantly intense reflections | 0.0554 |
Weighted residual factors for significantly intense reflections | 0.1253 |
Weighted residual factors for all reflections included in the refinement | 0.1466 |
Goodness-of-fit parameter for all reflections included in the refinement | 1.022 |
Diffraction radiation wavelength | 0.71073 Å |
Diffraction radiation type | MoKα |