Information card for entry 4343485
Common name | Pd(k1-N-p-ClC6H4NO)2(CNArDipp2)2 |
Formula | C82 H102 Cl2 N4 O4 Pd |
Calculated formula | C82 H102 Cl2 N4 O4 Pd |
SMILES | [N](=O)(c1ccc(cc1)Cl)[Pd](C#[N]c1c(cccc1c1c(cccc1C(C)C)C(C)C)c1c(cccc1C(C)C)C(C)C)(C#[N]c1c(cccc1c1c(cccc1C(C)C)C(C)C)c1c(cccc1C(C)C)C(C)C)[N](=O)c1ccc(cc1)Cl.CCOCC.CCOCC |
Title of publication | Solution Dynamics of Redox Noninnocent Nitrosoarene Ligands: Mapping the Electronic Criteria for the Formation of Persistent Metal-Coordinated Nitroxide Radicals. |
Authors of publication | Barnett, Brandon R.; Labios, Liezel A.; Moore, Curtis E.; England, Jason; Rheingold, Arnold L.; Wieghardt, Karl; Figueroa, Joshua S. |
Journal of publication | Inorganic chemistry |
Year of publication | 2015 |
Journal volume | 54 |
Journal issue | 14 |
Pages of publication | 7110 - 7121 |
a | 13.967 ± 0.003 Å |
b | 17.49 ± 0.004 Å |
c | 16.936 ± 0.005 Å |
α | 90° |
β | 114.091 ± 0.003° |
γ | 90° |
Cell volume | 3776.8 ± 1.6 Å3 |
Cell temperature | 100 ± 2 K |
Ambient diffraction temperature | 100 ± 2 K |
Number of distinct elements | 6 |
Space group number | 14 |
Hermann-Mauguin space group symbol | P 1 21/c 1 |
Hall space group symbol | -P 2ybc |
Residual factor for all reflections | 0.0535 |
Residual factor for significantly intense reflections | 0.0367 |
Weighted residual factors for significantly intense reflections | 0.0853 |
Weighted residual factors for all reflections included in the refinement | 0.0938 |
Goodness-of-fit parameter for all reflections included in the refinement | 1.021 |
Diffraction radiation wavelength | 0.71073 Å |
Diffraction radiation type | MoKα |