Information card for entry 4343488
Common name | Pd(k1-N-p-MeArNO)2(CNArDipp2)2 |
Formula | C84 H108 N4 O4 Pd |
Calculated formula | C84 H108 N4 O4 Pd |
SMILES | C(#[N]c1c(cccc1c1c(cccc1C(C)C)C(C)C)c1c(C(C)C)cccc1C(C)C)[Pd](C#[N]c1c(cccc1c1c(cccc1C(C)C)C(C)C)c1c(cccc1C(C)C)C(C)C)([N](=O)c1ccc(cc1)C)[N](=O)c1ccc(cc1)C.C(C)OCC.C(C)OCC |
Title of publication | Solution Dynamics of Redox Noninnocent Nitrosoarene Ligands: Mapping the Electronic Criteria for the Formation of Persistent Metal-Coordinated Nitroxide Radicals. |
Authors of publication | Barnett, Brandon R.; Labios, Liezel A.; Moore, Curtis E.; England, Jason; Rheingold, Arnold L.; Wieghardt, Karl; Figueroa, Joshua S. |
Journal of publication | Inorganic chemistry |
Year of publication | 2015 |
Journal volume | 54 |
Journal issue | 14 |
Pages of publication | 7110 - 7121 |
a | 13.973 ± 0.002 Å |
b | 17.461 ± 0.003 Å |
c | 16.912 ± 0.003 Å |
α | 90° |
β | 113.135 ± 0.002° |
γ | 90° |
Cell volume | 3794.4 ± 1.1 Å3 |
Cell temperature | 100 ± 2 K |
Ambient diffraction temperature | 100 ± 2 K |
Number of distinct elements | 5 |
Space group number | 14 |
Hermann-Mauguin space group symbol | P 1 21/c 1 |
Hall space group symbol | -P 2ybc |
Residual factor for all reflections | 0.0862 |
Residual factor for significantly intense reflections | 0.0518 |
Weighted residual factors for significantly intense reflections | 0.117 |
Weighted residual factors for all reflections included in the refinement | 0.1332 |
Goodness-of-fit parameter for all reflections included in the refinement | 1.027 |
Diffraction radiation wavelength | 0.71073 Å |
Diffraction radiation type | MoKα |