Information card for entry 4343490
Common name | Pd(k1-N-p-CNC6H4NO)2(CNArDipp2)2 |
Formula | C88 H112 N6 O5 Pd |
Calculated formula | C76 H82 N6 O2 Pd |
SMILES | C(#[N]c1c(cccc1c1c(cccc1C(C)C)C(C)C)c1c(cccc1C(C)C)C(C)C)[Pd]([N](=O)c1ccc(cc1)C#N)(C#[N]c1c(cccc1c1c(cccc1C(C)C)C(C)C)c1c(cccc1C(C)C)C(C)C)[N](=O)c1ccc(cc1)C#N |
Title of publication | Solution Dynamics of Redox Noninnocent Nitrosoarene Ligands: Mapping the Electronic Criteria for the Formation of Persistent Metal-Coordinated Nitroxide Radicals. |
Authors of publication | Barnett, Brandon R.; Labios, Liezel A.; Moore, Curtis E.; England, Jason; Rheingold, Arnold L.; Wieghardt, Karl; Figueroa, Joshua S. |
Journal of publication | Inorganic chemistry |
Year of publication | 2015 |
Journal volume | 54 |
Journal issue | 14 |
Pages of publication | 7110 - 7121 |
a | 14.702 ± 0.0014 Å |
b | 16.958 ± 0.0015 Å |
c | 16.2845 ± 0.0015 Å |
α | 90° |
β | 112.81 ± 0.005° |
γ | 90° |
Cell volume | 3742.5 ± 0.6 Å3 |
Cell temperature | 90 ± 2 K |
Ambient diffraction temperature | 90 K |
Number of distinct elements | 5 |
Space group number | 14 |
Hermann-Mauguin space group symbol | P 1 21/n 1 |
Hall space group symbol | -P 2yn |
Residual factor for all reflections | 0.0567 |
Residual factor for significantly intense reflections | 0.0394 |
Weighted residual factors for significantly intense reflections | 0.1205 |
Weighted residual factors for all reflections included in the refinement | 0.1542 |
Goodness-of-fit parameter for all reflections included in the refinement | 1.152 |
Diffraction radiation probe | x-ray |
Diffraction radiation wavelength | 0.71073 Å |
Diffraction radiation type | MoKα |