Information card for entry 4343493
Common name | Pd(h2-N,O-m-BrC6H4NO)(CNArDipp2)2 |
Formula | C68 H78 Br N3 O Pd |
Calculated formula | C68 H78 Br N3 O Pd |
Title of publication | Solution Dynamics of Redox Noninnocent Nitrosoarene Ligands: Mapping the Electronic Criteria for the Formation of Persistent Metal-Coordinated Nitroxide Radicals. |
Authors of publication | Barnett, Brandon R.; Labios, Liezel A.; Moore, Curtis E.; England, Jason; Rheingold, Arnold L.; Wieghardt, Karl; Figueroa, Joshua S. |
Journal of publication | Inorganic chemistry |
Year of publication | 2015 |
Journal volume | 54 |
Journal issue | 14 |
Pages of publication | 7110 - 7121 |
a | 25.8348 ± 0.0008 Å |
b | 11.8191 ± 0.0003 Å |
c | 20.1027 ± 0.0005 Å |
α | 90° |
β | 102.268 ± 0.001° |
γ | 90° |
Cell volume | 5998.1 ± 0.3 Å3 |
Cell temperature | 100 ± 2 K |
Ambient diffraction temperature | 100 K |
Number of distinct elements | 6 |
Space group number | 14 |
Hermann-Mauguin space group symbol | P 1 21/c 1 |
Hall space group symbol | -P 2ybc |
Residual factor for all reflections | 0.0588 |
Residual factor for significantly intense reflections | 0.0398 |
Weighted residual factors for significantly intense reflections | 0.0989 |
Weighted residual factors for all reflections included in the refinement | 0.1155 |
Goodness-of-fit parameter for all reflections included in the refinement | 1.061 |
Diffraction radiation probe | x-ray |
Diffraction radiation wavelength | 0.71073 Å |
Diffraction radiation type | MoKα |