Information card for entry 4343503
Formula | C114 H192 Co2 Cr2 K2 N16 O12 P6 |
Calculated formula | C114 H192 Co2 Cr2 K2 N16 O12 P6 |
Title of publication | Bimetallic Cobalt-Dinitrogen Complexes: Impact of the Supporting Metal on N2 Activation. |
Authors of publication | Clouston, Laura J.; Bernales, Varinia; Carlson, Rebecca K.; Gagliardi, Laura; Lu, Connie C. |
Journal of publication | Inorganic chemistry |
Year of publication | 2015 |
Journal volume | 54 |
Journal issue | 19 |
Pages of publication | 9263 - 9270 |
a | 11.2453 ± 0.0003 Å |
b | 31.9918 ± 0.0007 Å |
c | 18.978 ± 0.0004 Å |
α | 90° |
β | 95.042 ± 0.001° |
γ | 90° |
Cell volume | 6801.1 ± 0.3 Å3 |
Cell temperature | 173 ± 2 K |
Ambient diffraction temperature | 173 ± 2 K |
Number of distinct elements | 8 |
Space group number | 4 |
Hermann-Mauguin space group symbol | P 1 21 1 |
Hall space group symbol | P 2yb |
Residual factor for all reflections | 0.0558 |
Residual factor for significantly intense reflections | 0.047 |
Weighted residual factors for significantly intense reflections | 0.113 |
Weighted residual factors for all reflections included in the refinement | 0.1177 |
Goodness-of-fit parameter for all reflections included in the refinement | 1.065 |
Diffraction radiation wavelength | 1.54178 Å |
Diffraction radiation type | CuKα |