Information card for entry 4343506
Formula | C49 H58 B6 Cl2 Gd2 N32 |
Calculated formula | C49 H58 B6 Cl2 Gd2 N32 |
Title of publication | New Family of Lanthanide-Based Complexes with Different Scorpionate-Type Ligands: A Rare Case Where Dysprosium and Ytterbium Analogues Display Single-Ion-Magnet Behavior. |
Authors of publication | Lannes, Anthony; Luneau, Dominique |
Journal of publication | Inorganic chemistry |
Year of publication | 2015 |
Journal volume | 54 |
Journal issue | 14 |
Pages of publication | 6736 - 6743 |
a | 13.372 ± 0.005 Å |
b | 17.327 ± 0.005 Å |
c | 14.665 ± 0.005 Å |
α | 90° |
β | 90° |
γ | 90° |
Cell volume | 3398 ± 2 Å3 |
Cell temperature | 293 K |
Ambient diffraction temperature | 293 K |
Number of distinct elements | 6 |
Space group number | 36 |
Hermann-Mauguin space group symbol | C m c 21 |
Hall space group symbol | C 2c -2 |
Residual factor for all reflections | 0.096 |
Residual factor for significantly intense reflections | 0.0612 |
Weighted residual factors for all reflections | 0.0773 |
Weighted residual factors for significantly intense reflections | 0.0551 |
Weighted residual factors for all reflections included in the refinement | 0.051 |
Goodness-of-fit parameter for all reflections included in the refinement | 1.1051 |
Diffraction radiation wavelength | 0.71069 Å |
Diffraction radiation type | MoKα |