Information card for entry 4343516
Formula | C26 H14 F3 N2 P0.5 S12 |
Calculated formula | C26 H14 F3 N2 P0.5 S12 |
Title of publication | Bilayer Molecular Metals Based on Dissymmetrical Electron Donors. |
Authors of publication | Oliveira, Sandrina; Ministro, José; Santos, Isabel C.; Belo, Dulce; Lopes, Elsa B.; Rabaça, Sandra; Canadell, Enric; Almeida, Manuel |
Journal of publication | Inorganic chemistry |
Year of publication | 2015 |
Journal volume | 54 |
Journal issue | 14 |
Pages of publication | 6677 - 6679 |
a | 4.8507 ± 0.0012 Å |
b | 5.8341 ± 0.0013 Å |
c | 28.44 ± 0.006 Å |
α | 89.122 ± 0.008° |
β | 89.403 ± 0.009° |
γ | 85.026 ± 0.009° |
Cell volume | 801.7 ± 0.3 Å3 |
Cell temperature | 150 ± 2 K |
Ambient diffraction temperature | 150 ± 2 K |
Number of distinct elements | 6 |
Space group number | 2 |
Hermann-Mauguin space group symbol | P -1 |
Hall space group symbol | -P 1 |
Residual factor for all reflections | 0.1485 |
Residual factor for significantly intense reflections | 0.1117 |
Weighted residual factors for significantly intense reflections | 0.2361 |
Weighted residual factors for all reflections included in the refinement | 0.2475 |
Goodness-of-fit parameter for all reflections included in the refinement | 1.108 |
Diffraction radiation wavelength | 0.71073 Å |
Diffraction radiation type | MoKα |