Information card for entry 4343562
Formula | C14 H9 N2 O6 Zn |
Calculated formula | C14 H9 N2 O6 Zn |
Title of publication | Hydrostable and Nitryl/Methyl-Functionalized Metal-Organic Framework for Drug Delivery and Highly Selective CO~2~ Adsorption |
Authors of publication | Ma, De-Yun; Li, Zhi; Xiao, Jun-Xia; Deng, Rong; Lin, Pei-Feng; Chen, Rui-Qun; Liang, Yun-Qiu; Guo, Hai-Fu; Liu, Bei; Liu, Jian-Qiang |
Journal of publication | Inorganic Chemistry |
Year of publication | 2015 |
Journal volume | 54 |
Journal issue | 14 |
Pages of publication | 6719 - 6726 |
a | 18.203 ± 0.005 Å |
b | 29.089 ± 0.008 Å |
c | 7.637 ± 0.002 Å |
α | 90° |
β | 103.008 ± 0.006° |
γ | 90° |
Cell volume | 3940.1 ± 1.8 Å3 |
Cell temperature | 296 ± 2 K |
Ambient diffraction temperature | 296 ± 2 K |
Number of distinct elements | 5 |
Space group number | 15 |
Hermann-Mauguin space group symbol | C 1 2/c 1 |
Hall space group symbol | -C 2yc |
Residual factor for all reflections | 0.0576 |
Residual factor for significantly intense reflections | 0.0407 |
Weighted residual factors for significantly intense reflections | 0.0885 |
Weighted residual factors for all reflections included in the refinement | 0.0923 |
Goodness-of-fit parameter for all reflections included in the refinement | 1.003 |
Diffraction radiation wavelength | 0.71073 Å |
Diffraction radiation type | MoKα |