Information card for entry 4343564
Formula | C24 H44 N6 O10 Pb |
Calculated formula | C24 H44 N6 O10 Pb |
Title of publication | Investigating the Complexation of the Pb(2+)/Bi(3+) Pair with Dipicolinate Cyclen Ligands. |
Authors of publication | Lima, Luís M P; Beyler, Maryline; Delgado, Rita; Platas-Iglesias, Carlos; Tripier, Raphaël |
Journal of publication | Inorganic chemistry |
Year of publication | 2015 |
Journal volume | 54 |
Journal issue | 14 |
Pages of publication | 7045 - 7057 |
a | 12.5172 ± 0.0003 Å |
b | 17.9162 ± 0.0005 Å |
c | 13.4738 ± 0.0003 Å |
α | 90° |
β | 91.451 ± 0.002° |
γ | 90° |
Cell volume | 3020.67 ± 0.13 Å3 |
Cell temperature | 297 ± 2 K |
Ambient diffraction temperature | 297 ± 2 K |
Number of distinct elements | 5 |
Space group number | 15 |
Hermann-Mauguin space group symbol | C 1 2/c 1 |
Hall space group symbol | -C 2yc |
Residual factor for all reflections | 0.0307 |
Residual factor for significantly intense reflections | 0.0274 |
Weighted residual factors for significantly intense reflections | 0.0698 |
Weighted residual factors for all reflections included in the refinement | 0.0705 |
Goodness-of-fit parameter for all reflections included in the refinement | 1.145 |
Diffraction radiation probe | x-ray |
Diffraction radiation wavelength | 0.71073 Å |
Diffraction radiation type | MoKα |