Information card for entry 4343869
Chemical name |
Co (O H2)2 (Au (C N)2)2 |
Formula |
C4 H4 Au2 Co N4 O2 |
Calculated formula |
C4 Au2 Co N4 O2 |
Title of publication |
Magnetic frustration and spin disorder in isostructural M(mu-O H2)2 [Au (C N)2]2 (M = Mn, Fe, Co) coordination polymers containing double aqua-bridged chains: SQUID and mueSR studies |
Authors of publication |
Lefebvre, J.; Tyagi, P.; Trudel, S.; Leznoff, D.B.; Pacradouni, V.; Sonier, J.E.; Kaiser, C. |
Journal of publication |
Inorganic Chemistry |
Year of publication |
2009 |
Journal volume |
48 |
Pages of publication |
55 - 67 |
a |
6.4 Å |
b |
20.61 Å |
c |
3.39 Å |
α |
90° |
β |
90.48° |
γ |
90° |
Cell volume |
447.139 Å3 |
Number of distinct elements |
6 |
Space group number |
10 |
Hermann-Mauguin space group symbol |
P 1 2/m 1 |
Hall space group symbol |
-P 2y |
Yes |
No |
No |