Information card for entry 4343952
Formula | C12 H6 Fe N10 |
Calculated formula | C12 H6 Fe N10 |
Title of publication | Homoleptic Iron(II) Complexes with the Ionogenic Ligand 6,6'-Bis(1H-tetrazol-5-yl)-2,2'-bipyridine: Spin Crossover Behavior in a Singular 2D Spin Crossover Coordination Polymer. |
Authors of publication | Seredyuk, Maksym; Piñeiro-López, Lucía; Muñoz, M Carmen; Martínez-Casado, Francisco J; Molnár, Gábor; Rodriguez-Velamazán, José Alberto; Bousseksou, Azzedine; Real, José Antonio |
Journal of publication | Inorganic chemistry |
Year of publication | 2015 |
Journal volume | 54 |
Journal issue | 15 |
Pages of publication | 7424 - 7432 |
a | 13.861 ± 0.003 Å |
b | 8.245 ± 0.0016 Å |
c | 20.792 ± 0.004 Å |
α | 90° |
β | 90° |
γ | 90° |
Cell volume | 2376.2 ± 0.8 Å3 |
Cell temperature | 100 ± 2 K |
Ambient diffraction temperature | 100 ± 2 K |
Number of distinct elements | 4 |
Space group number | 61 |
Hermann-Mauguin space group symbol | P b c a |
Hall space group symbol | -P 2ac 2ab |
Residual factor for all reflections | 0.0449 |
Residual factor for significantly intense reflections | 0.04 |
Weighted residual factors for significantly intense reflections | 0.0983 |
Weighted residual factors for all reflections included in the refinement | 0.1131 |
Goodness-of-fit parameter for all reflections included in the refinement | 1.168 |
Diffraction radiation wavelength | 0.7999 Å |
Diffraction radiation type | synchrotron |