Information card for entry 4343954
Formula | C45 H39 F6 N4 O0.5 P2 Ru |
Calculated formula | C45 H39 F6 N4 O0.5 P2 Ru |
Title of publication | Further Insight into the Lability of MeCN Ligands of Cytotoxic Cycloruthenated Compounds: Evidence for the Antisymbiotic Effect Trans to the Carbon Atom at the Ru Center. |
Authors of publication | Barbosa, Ana Soraya Lima; Werlé, Christophe; Colunga, Claudia Olivia Oliva; Rodríguez, Cecilia Franco; Toscano, Ruben Alfredo; Le Lagadec, Ronan; Pfeffer, Michel |
Journal of publication | Inorganic chemistry |
Year of publication | 2015 |
Journal volume | 54 |
Journal issue | 15 |
Pages of publication | 7617 - 7626 |
a | 10.5548 ± 0.0007 Å |
b | 13.0455 ± 0.0008 Å |
c | 15.4633 ± 0.001 Å |
α | 85.8168 ± 0.0013° |
β | 86.5947 ± 0.0013° |
γ | 72.1131 ± 0.0013° |
Cell volume | 2019.3 ± 0.2 Å3 |
Cell temperature | 298 ± 2 K |
Ambient diffraction temperature | 298 ± 2 K |
Number of distinct elements | 7 |
Space group number | 2 |
Hermann-Mauguin space group symbol | P -1 |
Hall space group symbol | -P 1 |
Residual factor for all reflections | 0.0568 |
Residual factor for significantly intense reflections | 0.0487 |
Weighted residual factors for significantly intense reflections | 0.1278 |
Weighted residual factors for all reflections included in the refinement | 0.1333 |
Goodness-of-fit parameter for all reflections included in the refinement | 1.03 |
Diffraction radiation wavelength | 0.71073 Å |
Diffraction radiation type | MoKα |