Information card for entry 4343963
Formula | C28 H41 F3 N4 O3 P2 S |
Calculated formula | C28 H41 F3 N4 O3 P2 S |
SMILES | P12N(P(N1C(C)(C)C)[N+](=CN2c1c(cc(cc1C)C)C)c1c(cc(cc1C)C)C)C(C)(C)C.S(=O)(=O)([O-])C(F)(F)F |
Title of publication | Structures, Electronics, and Reactivity of Strained Phosphazane Cages: A Combined Experimental and Computational Study. |
Authors of publication | Roth, Torsten; Vasilenko, Vladislav; Wadepohl, Hubert; Wright, Dominic S.; Gade, Lutz H. |
Journal of publication | Inorganic chemistry |
Year of publication | 2015 |
Journal volume | 54 |
Journal issue | 15 |
Pages of publication | 7636 - 7644 |
a | 11.314 ± 0.006 Å |
b | 15.381 ± 0.008 Å |
c | 18.388 ± 0.01 Å |
α | 90° |
β | 100.801 ± 0.011° |
γ | 90° |
Cell volume | 3143 ± 3 Å3 |
Cell temperature | 100 ± 2 K |
Ambient diffraction temperature | 100 ± 1 K |
Number of distinct elements | 7 |
Space group number | 14 |
Hermann-Mauguin space group symbol | P 1 21/c 1 |
Hall space group symbol | -P 2ybc |
Residual factor for all reflections | 0.0587 |
Residual factor for significantly intense reflections | 0.04 |
Weighted residual factors for significantly intense reflections | 0.0982 |
Weighted residual factors for all reflections included in the refinement | 0.1128 |
Goodness-of-fit parameter for all reflections included in the refinement | 1.063 |
Diffraction radiation probe | x-ray |
Diffraction radiation wavelength | 0.71073 Å |
Diffraction radiation type | MoKα |