Information card for entry 4343973
Formula | C44 H52 Au0.69 Ni0.31 O4 S4 |
Calculated formula | C44 H52 Au0.686 Ni0.314 O4 S4 |
Title of publication | Molecular Alloys of Neutral Gold/Nickel Dithiolene Complexes in Single-Component Semiconductors. |
Authors of publication | Mebrouk, Kenny; Kaddour, Wafa; Auban-Senzier, Pascale; Pasquier, Claude; Jeannin, Olivier; Camerel, Franck; Fourmigué, Marc |
Journal of publication | Inorganic chemistry |
Year of publication | 2015 |
Journal volume | 54 |
Journal issue | 15 |
Pages of publication | 7454 - 7460 |
a | 9.3119 ± 0.0003 Å |
b | 13.8821 ± 0.0005 Å |
c | 18.426 ± 0.0006 Å |
α | 105.149 ± 0.001° |
β | 99.557 ± 0.002° |
γ | 107.742 ± 0.001° |
Cell volume | 2110.15 ± 0.13 Å3 |
Cell temperature | 150 ± 2 K |
Ambient diffraction temperature | 150 ± 2 K |
Number of distinct elements | 6 |
Space group number | 2 |
Hermann-Mauguin space group symbol | P -1 |
Hall space group symbol | -P 1 |
Residual factor for all reflections | 0.0623 |
Residual factor for significantly intense reflections | 0.0433 |
Weighted residual factors for significantly intense reflections | 0.117 |
Weighted residual factors for all reflections included in the refinement | 0.1435 |
Goodness-of-fit parameter for all reflections included in the refinement | 1.14 |
Diffraction radiation wavelength | 0.71073 Å |
Diffraction radiation type | MoKα |