Information card for entry 4343991
Formula | C77 H66 Cl10 Co4 N12 |
Calculated formula | C77 H66 Cl10 Co4 N12 |
Title of publication | Versatile Coordination Mode of a New Pyridine-Based Ditopic Ligand with Transition Metals: From Regular Pyridine to Alkyne and Alkenyl Bindings and Indolizinium Formation. |
Authors of publication | Kumar, Sushil; Mandon, Dominique |
Journal of publication | Inorganic chemistry |
Year of publication | 2015 |
Journal volume | 54 |
Journal issue | 15 |
Pages of publication | 7481 - 7491 |
a | 11.4848 ± 0.0003 Å |
b | 14.0632 ± 0.0004 Å |
c | 14.664 ± 0.0003 Å |
α | 114.033 ± 0.002° |
β | 104.092 ± 0.002° |
γ | 103.262 ± 0.002° |
Cell volume | 1948.36 ± 0.11 Å3 |
Cell temperature | 170 ± 2 K |
Ambient diffraction temperature | 170 ± 2 K |
Number of distinct elements | 5 |
Space group number | 2 |
Hermann-Mauguin space group symbol | P -1 |
Hall space group symbol | -P 1 |
Residual factor for all reflections | 0.0522 |
Residual factor for significantly intense reflections | 0.0405 |
Weighted residual factors for significantly intense reflections | 0.1006 |
Weighted residual factors for all reflections included in the refinement | 0.1109 |
Goodness-of-fit parameter for all reflections included in the refinement | 1.072 |
Diffraction radiation probe | x-ray |
Diffraction radiation wavelength | 0.71073 Å |
Diffraction radiation type | MoKα |