Information card for entry 4344001
Formula | C42 H32 Cl2 N8 O2 Ru |
Calculated formula | C42 H28 Cl2 N8 O2 Ru |
Title of publication | New Series of Dinuclear Ruthenium(II) Complexes Synthesized Using Photoisomerization for Efficient Water Oxidation Catalysis. |
Authors of publication | Hirahara, Masanari; Nagai, Sho; Takahashi, Kosuke; Saito, Kenji; Yui, Tatsuto; Yagi, Masayuki |
Journal of publication | Inorganic chemistry |
Year of publication | 2015 |
Journal volume | 54 |
Journal issue | 15 |
Pages of publication | 7627 - 7635 |
a | 12.542 ± 0.005 Å |
b | 13.661 ± 0.005 Å |
c | 13.794 ± 0.006 Å |
α | 71.055 ± 0.015° |
β | 74.7 ± 0.018° |
γ | 64.55 ± 0.014° |
Cell volume | 1997 ± 1.4 Å3 |
Cell temperature | 298 K |
Ambient diffraction temperature | 298 K |
Number of distinct elements | 6 |
Space group number | 2 |
Hermann-Mauguin space group symbol | P -1 |
Hall space group symbol | -P 1 |
Residual factor for all reflections | 0.0596 |
Residual factor for significantly intense reflections | 0.0531 |
Weighted residual factors for significantly intense reflections | 0.1641 |
Weighted residual factors for all reflections included in the refinement | 0.177 |
Goodness-of-fit parameter for all reflections included in the refinement | 0.999 |
Diffraction radiation wavelength | 0.71075 Å |
Diffraction radiation type | MoKα |