Information card for entry 4344012
Formula | C13 H12 Cl2 Hg N2 O |
Calculated formula | C13 H12 Cl2 Hg N2 O |
SMILES | [Hg]1(Cl)(Cl)[n]2c(cccc2OC)C=[N]1c1ccccc1 |
Title of publication | Tunable Luminescence and Application in Dye-Sensitized Solar Cells of Zn(II)/Hg(II) Complexes: Methyl Substitution-Induced Supramolecular Structures Based on (E)-N-(6-Methoxypyridin-2-ylmethylene)arylamine Derivatives. |
Authors of publication | Dong, Yu-Wei; Fan, Rui-Qing; Wang, Ping; Wei, Li-Guo; Wang, Xin-Ming; Gao, Song; Zhang, Hui-Jie; Yang, Yu-Lin; Wang, Yu-Lei |
Journal of publication | Inorganic chemistry |
Year of publication | 2015 |
Journal volume | 54 |
Journal issue | 16 |
Pages of publication | 7742 - 7752 |
a | 20.3658 ± 0.0009 Å |
b | 8.3249 ± 0.0003 Å |
c | 17.2301 ± 0.0005 Å |
α | 90° |
β | 93.363 ± 0.003° |
γ | 90° |
Cell volume | 2916.22 ± 0.19 Å3 |
Cell temperature | 293 ± 2 K |
Ambient diffraction temperature | 293 ± 2 K |
Number of distinct elements | 6 |
Space group number | 15 |
Hermann-Mauguin space group symbol | C 1 2/c 1 |
Hall space group symbol | -C 2yc |
Residual factor for all reflections | 0.0712 |
Residual factor for significantly intense reflections | 0.0438 |
Weighted residual factors for significantly intense reflections | 0.0665 |
Weighted residual factors for all reflections included in the refinement | 0.0772 |
Goodness-of-fit parameter for all reflections included in the refinement | 0.992 |
Diffraction radiation wavelength | 0.71073 Å |
Diffraction radiation type | MoKα |