Information card for entry 4344025
Common name | Fe(pic)3-oTf |
Formula | C20 H24 F6 Fe N6 O6 S2 |
Calculated formula | C20 H24 F6 Fe N6 O6 S2 |
SMILES | [Fe]123([n]4ccccc4C[NH2]1)([n]1ccccc1C[NH2]2)[n]1ccccc1C[NH2]3.S(=O)(=O)([O-])C(F)(F)F.S(=O)(=O)([O-])C(F)(F)F |
Title of publication | Spin Crossover in [Fe(2-Picolylamine)3](2+) Adjusted by Organosulfonate Anions. |
Authors of publication | Zhao, Xin-Hua; Zhang, Shao-Liang; Shao, Dong; Wang, Xin-Yi |
Journal of publication | Inorganic chemistry |
Year of publication | 2015 |
Journal volume | 54 |
Journal issue | 16 |
Pages of publication | 7857 - 7867 |
a | 7.5337 ± 0.0008 Å |
b | 10.7234 ± 0.0012 Å |
c | 17.7641 ± 0.0019 Å |
α | 75.399 ± 0.001° |
β | 89.59 ± 0.001° |
γ | 81.879 ± 0.001° |
Cell volume | 1374.2 ± 0.3 Å3 |
Cell temperature | 320 ± 2 K |
Ambient diffraction temperature | 320 ± 2 K |
Number of distinct elements | 7 |
Space group number | 2 |
Hermann-Mauguin space group symbol | P -1 |
Hall space group symbol | -P 1 |
Residual factor for all reflections | 0.0523 |
Residual factor for significantly intense reflections | 0.045 |
Weighted residual factors for significantly intense reflections | 0.1199 |
Weighted residual factors for all reflections included in the refinement | 0.1264 |
Goodness-of-fit parameter for all reflections included in the refinement | 1.054 |
Diffraction radiation wavelength | 0.71073 Å |
Diffraction radiation type | MoKα |