Information card for entry 4344051
Formula | C29 H23 Cl3 N5 O4 Rh |
Calculated formula | C29 H23 Cl3 N5 O4 Rh |
SMILES | c12c3c4c5c(cccc5)[n]3[Rh]35(n2cccc1c1c4C(=O)NC1=O)([n]1ccccc1C[N]13CCC[C@H]1C(=O)O5)Cl.C(Cl)Cl |
Title of publication | Correlation between the Stereochemistry and Bioactivity in Octahedral Rhodium Prolinato Complexes. |
Authors of publication | Rajaratnam, Rajathees; Martin, Elisabeth K.; Dörr, Markus; Harms, Klaus; Casini, Angela; Meggers, Eric |
Journal of publication | Inorganic chemistry |
Year of publication | 2015 |
Journal volume | 54 |
Journal issue | 16 |
Pages of publication | 8111 - 8120 |
a | 8.6398 ± 0.001 Å |
b | 13.3545 ± 0.0014 Å |
c | 23.619 ± 0.003 Å |
α | 90° |
β | 90° |
γ | 90° |
Cell volume | 2725.2 ± 0.5 Å3 |
Cell temperature | 100 ± 2 K |
Ambient diffraction temperature | 100 ± 2 K |
Number of distinct elements | 6 |
Space group number | 19 |
Hermann-Mauguin space group symbol | P 21 21 21 |
Hall space group symbol | P 2ac 2ab |
Residual factor for all reflections | 0.0359 |
Residual factor for significantly intense reflections | 0.0286 |
Weighted residual factors for significantly intense reflections | 0.0557 |
Weighted residual factors for all reflections included in the refinement | 0.0579 |
Goodness-of-fit parameter for all reflections included in the refinement | 1.035 |
Diffraction radiation wavelength | 0.71073 Å |
Diffraction radiation type | MoKα |