Information card for entry 4344062
Common name | Ru2(chp)4(THF)*2.4THF |
Formula | C33.41 H38.83 Cl4 N4 O7.35 Ru2 |
Calculated formula | C33.412 H38.824 Cl4 N4 O7.353 Ru2 |
Title of publication | Electronic Structure of Ru2(II,II) Oxypyridinates: Synthetic, Structural, and Theoretical Insights into Axial Ligand Binding. |
Authors of publication | Brown, Tristan R.; Dolinar, Brian S.; Hillard, Elizabeth A.; Clérac, Rodolphe; Berry, John F. |
Journal of publication | Inorganic chemistry |
Year of publication | 2015 |
Journal volume | 54 |
Journal issue | 17 |
Pages of publication | 8571 - 8589 |
a | 23.311 ± 0.002 Å |
b | 17.1328 ± 0.0019 Å |
c | 18.565 ± 0.002 Å |
α | 90° |
β | 98.481 ± 0.005° |
γ | 90° |
Cell volume | 7333.5 ± 1.3 Å3 |
Cell temperature | 100 ± 1 K |
Ambient diffraction temperature | 100.01 K |
Number of distinct elements | 6 |
Space group number | 15 |
Hermann-Mauguin space group symbol | C 1 2/c 1 |
Hall space group symbol | -C 2yc |
Residual factor for all reflections | 0.0295 |
Residual factor for significantly intense reflections | 0.0273 |
Weighted residual factors for significantly intense reflections | 0.0644 |
Weighted residual factors for all reflections included in the refinement | 0.0659 |
Goodness-of-fit parameter for all reflections included in the refinement | 1.045 |
Diffraction radiation probe | x-ray |
Diffraction radiation wavelength | 1.54178 Å |
Diffraction radiation type | CuKα |