Information card for entry 4344071
Formula | C86 H80 B F24 Fe N4 |
Calculated formula | C86 H80 B F24 Fe N4 |
SMILES | [Fe](=C1N(C2CCCCC=2N1c1c(cccc1CC)CC)c1c(cccc1CC)CC)=C1N(C2CCCCC=2N1c1c(cccc1CC)CC)c1c(cccc1CC)CC.FC(F)(F)c1cc(cc(c1)C(F)(F)F)[B-](c1cc(cc(c1)C(F)(F)F)C(F)(F)F)(c1cc(cc(c1)C(F)(F)F)C(F)(F)F)c1cc(cc(c1)C(F)(F)F)C(F)(F)F |
Title of publication | Linear and T-Shaped Iron(I) Complexes Supported by N-Heterocyclic Carbene Ligands: Synthesis and Structure Characterization. |
Authors of publication | Ouyang, Zhenwu; Du, Jingzhen; Wang, Lei; Kneebone, Jared L.; Neidig, Michael L.; Deng, Liang |
Journal of publication | Inorganic chemistry |
Year of publication | 2015 |
Journal volume | 54 |
Journal issue | 17 |
Pages of publication | 8808 - 8816 |
a | 18.7708 ± 0.0015 Å |
b | 16.9182 ± 0.0014 Å |
c | 26.489 ± 0.002 Å |
α | 90° |
β | 106.177 ± 0.001° |
γ | 90° |
Cell volume | 8079 ± 1.1 Å3 |
Cell temperature | 130 K |
Ambient diffraction temperature | 130 K |
Number of distinct elements | 6 |
Space group number | 4 |
Hermann-Mauguin space group symbol | P 1 21 1 |
Hall space group symbol | P 2yb |
Residual factor for all reflections | 0.177 |
Residual factor for significantly intense reflections | 0.0728 |
Weighted residual factors for significantly intense reflections | 0.1781 |
Weighted residual factors for all reflections included in the refinement | 0.2307 |
Goodness-of-fit parameter for all reflections included in the refinement | 0.993 |
Diffraction radiation wavelength | 0.71073 Å |
Diffraction radiation type | MoKα |