Information card for entry 4344079
Formula | C20 H134 Ge10 N20 O7 S72 Sb28 |
Calculated formula | C20 H120 Ge10 N20 S72 Sb28 |
Title of publication | Syntheses, Crystal Structures, Ion-Exchange, and Photocatalytic Properties of Two Amine-Directed Ge-Sb-S Compounds. |
Authors of publication | Zhang, Bo; Feng, Mei-Ling; Cui, Hong-Hua; Du, Cheng-Feng; Qi, Xing-Hui; Shen, Nan-Nan; Huang, Xiao-Ying |
Journal of publication | Inorganic chemistry |
Year of publication | 2015 |
Journal volume | 54 |
Journal issue | 17 |
Pages of publication | 8474 - 8481 |
a | 29.2964 ± 0.0008 Å |
b | 29.3261 ± 0.0005 Å |
c | 41.6006 ± 0.001 Å |
α | 90° |
β | 100.084 ± 0.002° |
γ | 90° |
Cell volume | 35189 ± 1.4 Å3 |
Cell temperature | 293 ± 2 K |
Ambient diffraction temperature | 293 ± 2 K |
Number of distinct elements | 7 |
Space group number | 15 |
Hermann-Mauguin space group symbol | C 1 2/c 1 |
Hall space group symbol | -C 2yc |
Residual factor for all reflections | 0.1233 |
Residual factor for significantly intense reflections | 0.0905 |
Weighted residual factors for significantly intense reflections | 0.1885 |
Weighted residual factors for all reflections included in the refinement | 0.1991 |
Goodness-of-fit parameter for all reflections included in the refinement | 1.077 |
Diffraction radiation wavelength | 0.71073 Å |
Diffraction radiation type | MoKα |