Information card for entry 4344081
Formula | C26 H18 N2 O30 P4 U3 |
Calculated formula | C26 H18 N2 O30 P4 U3 |
Title of publication | Uranyl Carboxyphosphonates Derived from Hydrothermal in Situ Ligand Reaction: Syntheses, Structures, and Computational Investigations. |
Authors of publication | Wu, Dai; Bai, Xiaojing; Tian, Hong-Rui; Yang, Weiting; Li, Zewen; Huang, Qing; Du, Shiyu; Sun, Zhong-Ming |
Journal of publication | Inorganic chemistry |
Year of publication | 2015 |
Journal volume | 54 |
Journal issue | 17 |
Pages of publication | 8617 - 8624 |
a | 9.6088 ± 0.0008 Å |
b | 9.7439 ± 0.0008 Å |
c | 11.0648 ± 0.0009 Å |
α | 81.842 ± 0.002° |
β | 85.131 ± 0.002° |
γ | 87.575 ± 0.001° |
Cell volume | 1021.3 ± 0.15 Å3 |
Cell temperature | 296 ± 2 K |
Ambient diffraction temperature | 296 ± 2 K |
Number of distinct elements | 6 |
Space group number | 2 |
Hermann-Mauguin space group symbol | P -1 |
Hall space group symbol | -P 1 |
Residual factor for all reflections | 0.0455 |
Residual factor for significantly intense reflections | 0.0344 |
Weighted residual factors for significantly intense reflections | 0.0705 |
Weighted residual factors for all reflections included in the refinement | 0.0754 |
Goodness-of-fit parameter for all reflections included in the refinement | 1.022 |
Diffraction radiation wavelength | 0.71073 Å |
Diffraction radiation type | MoKα |