Information card for entry 4344084
Formula | C132 H105 F18 N9 O6 P9 Re3 |
Calculated formula | C132 H105 F18 N9 O6 P9 Re3 |
Title of publication | Trinuclear and Tetranuclear Re(I) Rings Connected with Phenylene, Vinylene, and Ethynylene Chains: Synthesis, Photophysics, and Redox Properties. |
Authors of publication | Rohacova, Jana; Sekine, Akiko; Kawano, Tsubasa; Tamari, Sho; Ishitani, Osamu |
Journal of publication | Inorganic chemistry |
Year of publication | 2015 |
Journal volume | 54 |
Journal issue | 17 |
Pages of publication | 8769 - 8777 |
a | 18.4439 ± 0.0003 Å |
b | 18.9673 ± 0.0003 Å |
c | 21.1699 ± 0.0004 Å |
α | 72.567 ± 0.001° |
β | 89.778 ± 0.001° |
γ | 67.61 ± 0.001° |
Cell volume | 6481.8 ± 0.2 Å3 |
Cell temperature | 173 ± 2 K |
Ambient diffraction temperature | 173 ± 2 K |
Number of distinct elements | 7 |
Space group number | 2 |
Hermann-Mauguin space group symbol | P -1 |
Hall space group symbol | -P 1 |
Residual factor for all reflections | 0.0683 |
Residual factor for significantly intense reflections | 0.0559 |
Weighted residual factors for significantly intense reflections | 0.1354 |
Weighted residual factors for all reflections included in the refinement | 0.1443 |
Goodness-of-fit parameter for all reflections included in the refinement | 1.024 |
Diffraction radiation wavelength | 1.54186 Å |
Diffraction radiation type | CuKα |