Information card for entry 4344095
Formula | C89 H79 B N2 Ni P4 |
Calculated formula | C89 H79 B N2 Ni P4 |
SMILES | [Ni]1(P2N(c3c(C)cc(C)cc3C)CCN2c2ccccc2[P]1(c1ccccc1)c1ccccc1)([P](c1ccccc1)(c1ccccc1)c1ccccc1)[P](c1ccccc1)(c1ccccc1)c1ccccc1.c1(ccccc1)[B-](c1ccccc1)(c1ccccc1)c1ccccc1 |
Title of publication | Use of a Bidentate Ligand Featuring an N-Heterocyclic Phosphenium Cation (NHP(+)) to Systematically Explore the Bonding of NHP(+) Ligands with Nickel. |
Authors of publication | Bezpalko, Mark W.; Foxman, Bruce M.; Thomas, Christine M. |
Journal of publication | Inorganic chemistry |
Year of publication | 2015 |
Journal volume | 54 |
Journal issue | 17 |
Pages of publication | 8717 - 8726 |
a | 12.0649 ± 0.0006 Å |
b | 15.9904 ± 0.0008 Å |
c | 21.2462 ± 0.0011 Å |
α | 102.169 ± 0.003° |
β | 101.766 ± 0.002° |
γ | 100.942 ± 0.002° |
Cell volume | 3804.8 ± 0.3 Å3 |
Cell temperature | 120 K |
Ambient diffraction temperature | 120 K |
Number of distinct elements | 6 |
Space group number | 1 |
Hermann-Mauguin space group symbol | P 1 |
Hall space group symbol | P 1 |
Residual factor for all reflections | 0.073 |
Residual factor for significantly intense reflections | 0.0583 |
Weighted residual factors for all reflections | 0.1526 |
Weighted residual factors for significantly intense reflections | 0.1435 |
Weighted residual factors for all reflections included in the refinement | 0.1526 |
Goodness-of-fit parameter for all reflections included in the refinement | 0.9888 |
Diffraction radiation wavelength | 0.71073 Å |
Diffraction radiation type | MoKα |