Information card for entry 4344393
Formula | C40 H48 Cr2 N4 O20 Tb2 |
Calculated formula | C40 H48 Cr2 N4 O20 Tb2 |
Title of publication | A Family of {Cr(III)2Ln(III)2} Butterfly Complexes: Effect of the Lanthanide Ion on the Single-Molecule Magnet Properties. |
Authors of publication | Langley, Stuart K.; Wielechowski, Daniel P.; Chilton, Nicholas F.; Moubaraki, Boujemaa; Murray, Keith S. |
Journal of publication | Inorganic chemistry |
Year of publication | 2015 |
Journal volume | 54 |
Journal issue | 21 |
Pages of publication | 10497 - 10503 |
a | 7.9196 ± 0.0004 Å |
b | 17.3124 ± 0.0008 Å |
c | 17.4215 ± 0.0009 Å |
α | 90° |
β | 92.174 ± 0.002° |
γ | 90° |
Cell volume | 2386.9 ± 0.2 Å3 |
Cell temperature | 123 ± 2 K |
Ambient diffraction temperature | 123 ± 2 K |
Number of distinct elements | 6 |
Space group number | 14 |
Hermann-Mauguin space group symbol | P 1 21/n 1 |
Hall space group symbol | -P 2yn |
Residual factor for all reflections | 0.0631 |
Residual factor for significantly intense reflections | 0.0406 |
Weighted residual factors for significantly intense reflections | 0.0934 |
Weighted residual factors for all reflections included in the refinement | 0.1027 |
Goodness-of-fit parameter for all reflections included in the refinement | 1.021 |
Diffraction radiation wavelength | 0.71073 Å |
Diffraction radiation type | MoKα |