Information card for entry 4344401
Formula | C43 H74 Co N6 P3 Ti |
Calculated formula | C43 H74 Co N6 P3 Ti |
Title of publication | Heterobimetallic Ti/Co Complexes That Promote Catalytic N-N Bond Cleavage. |
Authors of publication | Wu, Bing; Gramigna, Kathryn M.; Bezpalko, Mark W.; Foxman, Bruce M.; Thomas, Christine M. |
Journal of publication | Inorganic chemistry |
Year of publication | 2015 |
Journal volume | 54 |
Journal issue | 22 |
Pages of publication | 10909 - 10917 |
a | 10.8002 ± 0.0005 Å |
b | 12.0096 ± 0.0005 Å |
c | 18.9465 ± 0.0008 Å |
α | 89.66 ± 0.003° |
β | 77.718 ± 0.003° |
γ | 79.127 ± 0.002° |
Cell volume | 2356.63 ± 0.18 Å3 |
Cell temperature | 120 K |
Ambient diffraction temperature | 120 K |
Number of distinct elements | 6 |
Space group number | 2 |
Hermann-Mauguin space group symbol | P -1 |
Hall space group symbol | -P 1 |
Residual factor for all reflections | 0.0652 |
Residual factor for significantly intense reflections | 0.0506 |
Weighted residual factors for all reflections | 0.1442 |
Weighted residual factors for significantly intense reflections | 0.1314 |
Weighted residual factors for all reflections included in the refinement | 0.1442 |
Goodness-of-fit parameter for all reflections included in the refinement | 0.9886 |
Diffraction radiation wavelength | 0.71073 Å |
Diffraction radiation type | MoKα |